{"text_format":"1","workbook":"xlsx","n_sheets":9,"sheets":["Menu","予算","簿","印刷","項目","報告","第１１号様式","単価データ","補助金単価"],"not_rendered":{"charts":0,"images":0,"macros":1,"external_links":0,"defined_names":18,"comments":1,"pivot_tables":0},"unopened":[],"bounds":{"document_bytes":16777216,"sheet_cells":100000,"rows_first":2000,"rows_last":500,"rows_between":2000,"halvings":0,"cell_chars":16384,"cell_head_chars":4096},"cells_cut":0,"cells_raw":0,"read":"whole","date_system":"1900"}

{"sheet":"Menu","index":0,"n_rows":35,"n_cols":5,"rows_kept":35,"cut":false,"hidden":false,"merged":[[1,2,1,3]]}
[]
[null,null,"はまクル認定クラブ会計　メニュー"]
[null,null,null,"Ver.1.0"]
[null,null,null,"項目名･予算額等を入力 ／ 執行済額を確認","※注１"]
[null,null,null,"会計簿を入力","※注２"]
[null,null,null,"会計簿を印刷","※注３"]
[null,null,null,"全項目の会計簿を一気に印刷","※注３"]
[null,null,null,"各項目の会計簿を個別に印刷､又は画面で確認"]
[null,null,null,"中間・決算報告書を作成"]
[null,null,null,"次年度の予算書(案)を作成"]
[]
[null,null,"　　　 ↑ 目的のボタンをクリックしてください"]
[]
[null,null,"※注１　収入は10項目、支出は50項目まで。予算額は必要なければ省略しても可。"]
[null,null,"※注２　会計簿全体で1000件、各項目は199件まで入力可能。"]
{"$rows_left_out":21}
{"sheet":"予算","index":1,"n_rows":188,"n_cols":15,"rows_kept":188,"cut":false,"hidden":false,"merged":[[1,0,1,1],[3,0,3,1],[1,2,1,4]]}
[null,null,null,null,null,null,null,null,null,null,null,{"$f":"E4+2018","v":2026}]
[null,null,"〇〇中はまクル認定クラブ",null,null,"会計",null,null,null,null,null,{"$f":"L1+1","v":2027}]
[]
[null,null,null,null,8,"年度",null,null,null,null,null,null,6]
[]
[null,"№\n（コード）","項　目　名","予 算 額","収入･支出済額","増　　減",null,"合計","予 算 額","収入･支出済額"]
[null,1,"会費",360000,{"$f":"DSUM(簿!$C$5:$H$1005,5,D69:D70)","v":360000},{"$f":"E7-D7","v":0},null,"収入",{"$f":"SUM(D7:D16)","v":677600},{"$f":"SUM(E7:E16)","v":677600}]
[null,2,"保険料",null,{"$f":"DSUM(簿!$C$5:$H$1005,5,D71:D72)","v":0},{"$f":"E8-D8","v":0},null,"支出",{"$f":"SUM(D17:D66)","v":677600},{"$f":"SUM(E17:E66)","v":677600}]
[null,3,"雑収入",1000,{"$f":"DSUM(簿!$C$5:$H$1005,5,D73:D74)","v":1000},{"$f":"E9-D9","v":0},null,"差引",{"$f":"I7-I8","v":0},{"$f":"J7-J8","v":0}]
[null,4,"会費（対象外）",60000,{"$f":"DSUM(簿!$C$5:$H$1005,5,D75:D76)","v":60000},0]
[null,5,"繰越金（対象外）",null,{"$f":"DSUM(簿!$C$5:$H$1005,5,D77:D78)","v":0},0]
[null,6,"保険料（対象外）",17600,{"$f":"DSUM(簿!$C$5:$H$1005,5,D79:D80)","v":17600},0,null,null,"参加生徒数","指導者数","活動クラブ種別","月の活動回数"]
[null,7,"雑収入（対象外）",null,{"$f":"DSUM(簿!$C$5:$H$1005,5,D81:D82)","v":0},0,null,null,20,2,"スポーツ",4]
[null,8,"補助金",239000,{"$f":"DSUM(簿!$C$5:$H$1005,5,D83:D84)","v":239000},0,"収",null,{"$f":"IF(I13>26,1,IF(I13>12,2,IF(I13>4,3,4)))","v":2},{"$f":"IF(J13>2,1,IF(J13>1,2,3))","v":2},{"$f":"IF(K13=\"スポーツ\",1,2)","v":1},{"$f":"IF(L13=4,1,IF(L13=3,2,IF(L13=2,3,4)))","v":1},null,{"$f":"VALUE(I14&J14&K14&L14)","v":2211},{"$f":"VLOOKUP(N14,単価データ!B3:D98,2,FALSE)","v":288000}]
[null,9,null,null,{"$f":"DSUM(簿!$C$5:$H$1005,5,D85:D86)","v":0},0,"入"]
{"$rows_left_out":174}
{"sheet":"簿","index":2,"n_rows":1006,"n_cols":17,"rows_kept":1006,"cut":false,"hidden":false,"merged":[]}
[null,null,null,null,null,null,null,"※月日は小数で"]
[null,null,null,null,null,null,null,"　例：10月1日 → 10.01"]
["　 月日で並び替え　　　　入力済データ　　　　 会計簿を印刷　　　　メニューに戻る",null,null,null,null,null,null,"※｢月日｣｢コード｣は省略不可",null,null,null,null,"コード"]
[" 　　　　　　　　　　　　を一気に消去",null,null,null,null,null,null,null,null,null,null,null,29,{"$f":"IF(M4=\"\",\"\",VLOOKUP(M4,予算!$B$7:$C$66,2))","v":"その他の経費（対象外）"}]
[null,"月日","コード","項　　目","摘　　　　　　　要","No","収入金額","支出金額","差引残額",null,null,null,"月日","摘　　　　　　　要","No","収入金額","支出金額"]
[{"$f":"IF(B6=\"\",\"\",DATE(IF(INT(B6)>=4,予算!$L$1,予算!$L$2),INT(B6),ROUND(MOD(B6,1)*100,0)))","v":"2026-09-01"},9.01,1,{"$f":"IF(C6=\"\",\"\",VLOOKUP(C6,予算!$B$7:$C$66,2))","v":"会費"},"参加費（9月分）",-1,60000,null,{"$f":"IF(C6=\"\",\"\",G6-H6)","v":60000}]
[{"$f":"IF(B7=\"\",\"\",DATE(IF(INT(B7)>=4,予算!$L$1,予算!$L$2),INT(B7),ROUND(MOD(B7,1)*100,0)))","v":"2026-09-01"},9.01,1,{"$f":"IF(C7=\"\",\"\",VLOOKUP(C7,予算!$B$7:$C$66,2))","v":"会費"},"参加費（10月分）",-2,60000,null,{"$f":"IF(C7=\"\",\"\",I6+G7-H7)","v":120000}]
[{"$f":"IF(B8=\"\",\"\",DATE(IF(INT(B8)>=4,予算!$L$1,予算!$L$2),INT(B8),ROUND(MOD(B8,1)*100,0)))","v":"2026-09-02"},9.02,6,{"$f":"IF(C8=\"\",\"\",VLOOKUP(C8,予算!$B$7:$C$66,2))","v":"保険料（対象外）"},"保険料",-3,17600,null,{"$f":"IF(C8=\"\",\"\",I7+G8-H8)","v":137600}]
[{"$f":"IF(B9=\"\",\"\",DATE(IF(INT(B9)>=4,予算!$L$1,予算!$L$2),INT(B9),ROUND(MOD(B9,1)*100,0)))","v":"2026-09-02"},9.02,27,{"$f":"IF(C9=\"\",\"\",VLOOKUP(C9,予算!$B$7:$C$66,2))","v":"保険料（対象外）"},"スポーツ安全保険料",4,null,17600,{"$f":"IF(C9=\"\",\"\",I8+G9-H9)","v":120000}]
[{"$f":"IF(B10=\"\",\"\",DATE(IF(INT(B10)>=4,予算!$L$1,予算!$L$2),INT(B10),ROUND(MOD(B10,1)*100,0)))","v":"2026-09-02"},9.02,19,{"$f":"IF(C10=\"\",\"\",VLOOKUP(C10,予算!$B$7:$C$66,2))","v":"雑務経費"},"アプリ使用料",5,null,27280,92720]
[{"$f":"IF(B11=\"\",\"\",DATE(IF(INT(B11)>=4,予算!$L$1,予算!$L$2),INT(B11),ROUND(MOD(B11,1)*100,0)))","v":"2026-09-03"},9.0299999999999994,14,{"$f":"IF(C11=\"\",\"\",VLOOKUP(C11,予算!$B$7:$C$66,2))","v":"印刷製本費"},"クラブ募集チラシ",6,null,30000,62720]
[{"$f":"IF(B12=\"\",\"\",DATE(IF(INT(B12)>=4,予算!$L$1,予算!$L$2),INT(B12),ROUND(MOD(B12,1)*100,0)))","v":"2026-10-01"},10.01,8,{"$f":"IF(C12=\"\",\"\",VLOOKUP(C12,予算!$B$7:$C$66,2))","v":"補助金"},"市より補助金",-7,143000,null,205720]
[{"$f":"IF(B13=\"\",\"\",DATE(IF(INT(B13)>=4,予算!$L$1,予算!$L$2),INT(B13),ROUND(MOD(B13,1)*100,0)))","v":"2026-10-05"},10.050000000000001,16,{"$f":"IF(C13=\"\",\"\",VLOOKUP(C13,予算!$B$7:$C$66,2))","v":"消耗品費"},"バレーボール",8,null,83600,122120]
[{"$f":"IF(B14=\"\",\"\",DATE(IF(INT(B14)>=4,予算!$L$1,予算!$L$2),INT(B14),ROUND(MOD(B14,1)*100,0)))","v":"2026-10-20"},10.199999999999999,11,{"$f":"IF(C14=\"\",\"\",VLOOKUP(C14,予算!$B$7:$C$66,2))","v":"諸謝金"},"指導者謝礼（9月分）",9,null,24000,98120]
[{"$f":"IF(B15=\"\",\"\",DATE(IF(INT(B15)>=4,予算!$L$1,予算!$L$2),INT(B15),ROUND(MOD(B15,1)*100,0)))","v":"2026-10-20"},10.199999999999999,11,{"$f":"IF(C15=\"\",\"\",VLOOKUP(C15,予算!$B$7:$C$66,2))","v":"諸謝金"},"指導者謝礼（9月分）所得税納付",9,null,2728,95392]
{"$rows_left_out":992}
{"sheet":"印刷","index":3,"n_rows":57,"n_cols":16,"rows_kept":57,"cut":false,"hidden":false,"merged":[[56,0,56,3],[4,2,4,3],[2,1,2,5],[3,4,3,6],[55,0,55,3]]}
["印刷用会計簿　入力は「簿」のシートで"]
[]
[null,{"$f":"\"令和\"&FIXED(予算!E4,0)&\"年度　\"&予算!C2&\"会計\"","v":"令和8年度　〇〇中はまクル認定クラブ会計"},null,null,null,null,2]
[null,null,null,null,{"$f":"IF(予算!C4=\"\",\"\",予算!C4&\"学校　\")","v":""}]
["月 日","項　　　目","摘　　　　　　　　　　　　要",null,"収入金額","支出金額","差引残額",null,null,{"$f":"簿!B1006","v":62},"件",{"$f":"INT((J5-1)/50)+1","v":2},"枚"]
[{"$f":"INDIRECT(J6)","v":2.2799999999999998},"諸謝金","事務局スタッフ謝礼（2月分）所得税納付",34,0,341,134626,null,null,{"$f":"\"簿!B\"&FIXED(50*($G$3-1)+6,0)","v":"簿!B56"},{"$f":"\"簿!d\"&FIXED(50*($G$3-1)+6,0)","v":"簿!d56"},{"$f":"\"簿!e\"&FIXED(50*($G$3-1)+6,0)","v":"簿!e56"},{"$f":"\"簿!f\"&FIXED(50*($G$3-1)+6,0)","v":"簿!f56"},{"$f":"\"簿!g\"&FIXED(50*($G$3-1)+6,0)","v":"簿!g56"},{"$f":"\"簿!h\"&FIXED(50*($G$3-1)+6,0)","v":"簿!h56"},{"$f":"\"簿!i\"&FIXED(50*($G$3-1)+6,0)","v":"簿!i56"}]
[2.2799999999999998,"諸謝金","見守りボランティア謝礼（2月分）",35,0,16000,118626,null,null,{"$f":"\"簿!B\"&FIXED(50*($G$3-1)+7,0)","v":"簿!B57"},{"$f":"\"簿!d\"&FIXED(50*($G$3-1)+7,0)","v":"簿!d57"},{"$f":"\"簿!e\"&FIXED(50*($G$3-1)+7,0)","v":"簿!e57"},{"$f":"\"簿!f\"&FIXED(50*($G$3-1)+7,0)","v":"簿!f57"},{"$f":"\"簿!g\"&FIXED(50*($G$3-1)+7,0)","v":"簿!g57"},{"$f":"\"簿!h\"&FIXED(50*($G$3-1)+7,0)","v":"簿!h57"},{"$f":"\"簿!i\"&FIXED(50*($G$3-1)+7,0)","v":"簿!i57"}]
[{"$f":"INDIRECT(J8)","v":2.2799999999999998},{"$f":"INDIRECT(K8)","v":"諸謝金"},{"$f":"INDIRECT(L8)","v":"見守りボランティア謝礼（2月分）所得税納付"},{"$f":"INDIRECT(M8)","v":35},{"$f":"INDIRECT(N8)","v":0},{"$f":"INDIRECT(O8)","v":1816},116810,null,null,{"$f":"\"簿!B\"&FIXED(50*($G$3-1)+8,0)","v":"簿!B58"},{"$f":"\"簿!d\"&FIXED(50*($G$3-1)+8,0)","v":"簿!d58"},{"$f":"\"簿!e\"&FIXED(50*($G$3-1)+8,0)","v":"簿!e58"},{"$f":"\"簿!f\"&FIXED(50*($G$3-1)+8,0)","v":"簿!f58"},{"$f":"\"簿!g\"&FIXED(50*($G$3-1)+8,0)","v":"簿!g58"},{"$f":"\"簿!h\"&FIXED(50*($G$3-1)+8,0)","v":"簿!h58"},{"$f":"\"簿!i\"&FIXED(50*($G$3-1)+8,0)","v":"簿!i58"}]
[2.2799999999999998,"借料及び損料","貸切バス代",36,0,116810,0,null,null,{"$f":"\"簿!B\"&FIXED(50*($G$3-1)+9,0)","v":"簿!B59"},{"$f":"\"簿!d\"&FIXED(50*($G$3-1)+9,0)","v":"簿!d59"},{"$f":"\"簿!e\"&FIXED(50*($G$3-1)+9,0)","v":"簿!e59"},{"$f":"\"簿!f\"&FIXED(50*($G$3-1)+9,0)","v":"簿!f59"},{"$f":"\"簿!g\"&FIXED(50*($G$3-1)+9,0)","v":"簿!g59"},{"$f":"\"簿!h\"&FIXED(50*($G$3-1)+9,0)","v":"簿!h59"},{"$f":"\"簿!i\"&FIXED(50*($G$3-1)+9,0)","v":"簿!i59"}]
[3.01,"会費（対象外）","参加費（3月分）",-37,60000,0,60000,null,null,{"$f":"\"簿!B\"&FIXED(50*($G$3-1)+10,0)","v":"簿!B60"},{"$f":"\"簿!d\"&FIXED(50*($G$3-1)+10,0)","v":"簿!d60"},{"$f":"\"簿!e\"&FIXED(50*($G$3-1)+10,0)","v":"簿!e60"},{"$f":"\"簿!f\"&FIXED(50*($G$3-1)+10,0)","v":"簿!f60"},{"$f":"\"簿!g\"&FIXED(50*($G$3-1)+10,0)","v":"簿!g60"},{"$f":"\"簿!h\"&FIXED(50*($G$3-1)+10,0)","v":"簿!h60"},{"$f":"\"簿!i\"&FIXED(50*($G$3-1)+10,0)","v":"簿!i60"}]
[3.25,"消耗品費（対象外）","事務用品",38,0,12115,47885,null,null,{"$f":"\"簿!B\"&FIXED(50*($G$3-1)+11,0)","v":"簿!B61"},{"$f":"\"簿!d\"&FIXED(50*($G$3-1)+11,0)","v":"簿!d61"},{"$f":"\"簿!e\"&FIXED(50*($G$3-1)+11,0)","v":"簿!e61"},{"$f":"\"簿!f\"&FIXED(50*($G$3-1)+11,0)","v":"簿!f61"},{"$f":"\"簿!g\"&FIXED(50*($G$3-1)+11,0)","v":"簿!g61"},{"$f":"\"簿!h\"&FIXED(50*($G$3-1)+11,0)","v":"簿!h61"},{"$f":"\"簿!i\"&FIXED(50*($G$3-1)+11,0)","v":"簿!i61"}]
[3.25,"諸謝金（対象外）","指導者謝礼（3月分）",39,0,24000,23885,null,null,{"$f":"\"簿!B\"&FIXED(50*($G$3-1)+12,0)","v":"簿!B62"},{"$f":"\"簿!d\"&FIXED(50*($G$3-1)+12,0)","v":"簿!d62"},{"$f":"\"簿!e\"&FIXED(50*($G$3-1)+12,0)","v":"簿!e62"},{"$f":"\"簿!f\"&FIXED(50*($G$3-1)+12,0)","v":"簿!f62"},{"$f":"\"簿!g\"&FIXED(50*($G$3-1)+12,0)","v":"簿!g62"},{"$f":"\"簿!h\"&FIXED(50*($G$3-1)+12,0)","v":"簿!h62"},{"$f":"\"簿!i\"&FIXED(50*($G$3-1)+12,0)","v":"簿!i62"}]
[3.25,"諸謝金（対象外）","指導者謝礼（3月分）所得税納付",39,0,2728,21157,null,null,{"$f":"\"簿!B\"&FIXED(50*($G$3-1)+13,0)","v":"簿!B63"},{"$f":"\"簿!d\"&FIXED(50*($G$3-1)+13,0)","v":"簿!d63"},{"$f":"\"簿!e\"&FIXED(50*($G$3-1)+13,0)","v":"簿!e63"},{"$f":"\"簿!f\"&FIXED(50*($G$3-1)+13,0)","v":"簿!f63"},{"$f":"\"簿!g\"&FIXED(50*($G$3-1)+13,0)","v":"簿!g63"},{"$f":"\"簿!h\"&FIXED(50*($G$3-1)+13,0)","v":"簿!h63"},{"$f":"\"簿!i\"&FIXED(50*($G$3-1)+13,0)","v":"簿!i63"}]
[3.25,"諸謝金（対象外）","事務局スタッフ謝礼（3月分）",40,0,3000,18157,null,null,{"$f":"\"簿!B\"&FIXED(50*($G$3-1)+14,0)","v":"簿!B64"},{"$f":"\"簿!d\"&FIXED(50*($G$3-1)+14,0)","v":"簿!d64"},{"$f":"\"簿!e\"&FIXED(50*($G$3-1)+14,0)","v":"簿!e64"},{"$f":"\"簿!f\"&FIXED(50*($G$3-1)+14,0)","v":"簿!f64"},{"$f":"\"簿!g\"&FIXED(50*($G$3-1)+14,0)","v":"簿!g64"},{"$f":"\"簿!h\"&FIXED(50*($G$3-1)+14,0)","v":"簿!h64"},{"$f":"\"簿!i\"&FIXED(50*($G$3-1)+14,0)","v":"簿!i64"}]
[3.25,"諸謝金（対象外）","事務局スタッフ謝礼（3月分）所得税納付",40,0,341,17816,null,null,{"$f":"\"簿!B\"&FIXED(50*($G$3-1)+15,0)","v":"簿!B65"},{"$f":"\"簿!d\"&FIXED(50*($G$3-1)+15,0)","v":"簿!d65"},{"$f":"\"簿!e\"&FIXED(50*($G$3-1)+15,0)","v":"簿!e65"},{"$f":"\"簿!f\"&FIXED(50*($G$3-1)+15,0)","v":"簿!f65"},{"$f":"\"簿!g\"&FIXED(50*($G$3-1)+15,0)","v":"簿!g65"},{"$f":"\"簿!h\"&FIXED(50*($G$3-1)+15,0)","v":"簿!h65"},{"$f":"\"簿!i\"&FIXED(50*($G$3-1)+15,0)","v":"簿!i65"}]
{"$rows_left_out":43}
{"sheet":"項目","index":4,"n_rows":225,"n_cols":7,"rows_kept":225,"cut":false,"hidden":false,"merged":[[111,0,111,2],[114,1,114,2],[221,0,221,2],[165,0,165,2],[166,0,166,2],[169,1,169,2],[220,0,220,2],[4,1,4,2],[55,0,55,2],[56,0,56,2],[59,1,59,2],[110,0,110,2]]}
[1,"番の項目を","※コードを入力したら、どちらかのボタンをクリック"]
["　↑ コードを入力",null,"※印刷はいきなり始まるので慌てんように！"]
[{"$f":"VLOOKUP(簿!M4,予算!$B$7:$C$66,2)","v":"その他の経費（対象外）"}]
[null,null,null,null,null,null,1]
["月 日","摘　　　　　　　　　　　　要",null,"予 算 額","収入金額","支出金額",{"$f":"IF(簿!M4>9,\"差引残額\",\"収入未済額\")","v":"差引残額"}]
[null,"予算額",null,{"$f":"VLOOKUP(簿!M4,予算!$B$7:$D$66,3)","v":0},null,null,{"$f":"D6","v":0}]
[{"$f":"IF(簿!M6=\"\",\"\",簿!M6)","v":""},{"$f":"IF(簿!N6=\"\",\"\",簿!N6)","v":""},{"$f":"IF(簿!O6=\"\",\"\",簿!O6)","v":""},null,{"$f":"IF(簿!P6=\"\",0,簿!P6)","v":0},{"$f":"IF(簿!Q6=\"\",0,簿!Q6)","v":0},{"$f":"IF(A7=\"\",\"\",G6-E7-F7)","v":""}]
[{"$f":"IF(簿!M7=\"\",\"\",簿!M7)","v":""},{"$f":"IF(簿!N7=\"\",\"\",簿!N7)","v":""},{"$f":"IF(簿!O7=\"\",\"\",簿!O7)","v":""},null,{"$f":"IF(簿!P7=\"\",0,簿!P7)","v":0},{"$f":"IF(簿!Q7=\"\",0,簿!Q7)","v":0},{"$f":"IF(A8=\"\",\"\",G7-E8-F8)","v":""}]
[{"$f":"IF(簿!M8=\"\",\"\",簿!M8)","v":""},{"$f":"IF(簿!N8=\"\",\"\",簿!N8)","v":""},{"$f":"IF(簿!O8=\"\",\"\",簿!O8)","v":""},null,{"$f":"IF(簿!P8=\"\",0,簿!P8)","v":0},{"$f":"IF(簿!Q8=\"\",0,簿!Q8)","v":0},""]
[{"$f":"IF(簿!M9=\"\",\"\",簿!M9)","v":""},{"$f":"IF(簿!N9=\"\",\"\",簿!N9)","v":""},{"$f":"IF(簿!O9=\"\",\"\",簿!O9)","v":""},null,{"$f":"IF(簿!P9=\"\",0,簿!P9)","v":0},{"$f":"IF(簿!Q9=\"\",0,簿!Q9)","v":0},""]
[{"$f":"IF(簿!M10=\"\",\"\",簿!M10)","v":""},{"$f":"IF(簿!N10=\"\",\"\",簿!N10)","v":""},{"$f":"IF(簿!O10=\"\",\"\",簿!O10)","v":""},null,{"$f":"IF(簿!P10=\"\",0,簿!P10)","v":0},{"$f":"IF(簿!Q10=\"\",0,簿!Q10)","v":0},""]
[{"$f":"IF(簿!M11=\"\",\"\",簿!M11)","v":""},{"$f":"IF(簿!N11=\"\",\"\",簿!N11)","v":""},{"$f":"IF(簿!O11=\"\",\"\",簿!O11)","v":""},null,{"$f":"IF(簿!P11=\"\",0,簿!P11)","v":0},{"$f":"IF(簿!Q11=\"\",0,簿!Q11)","v":0},""]
[{"$f":"IF(簿!M12=\"\",\"\",簿!M12)","v":""},{"$f":"IF(簿!N12=\"\",\"\",簿!N12)","v":""},{"$f":"IF(簿!O12=\"\",\"\",簿!O12)","v":""},null,{"$f":"IF(簿!P12=\"\",0,簿!P12)","v":0},{"$f":"IF(簿!Q12=\"\",0,簿!Q12)","v":0},""]
[{"$f":"IF(簿!M13=\"\",\"\",簿!M13)","v":""},{"$f":"IF(簿!N13=\"\",\"\",簿!N13)","v":""},{"$f":"IF(簿!O13=\"\",\"\",簿!O13)","v":""},null,{"$f":"IF(簿!P13=\"\",0,簿!P13)","v":0},{"$f":"IF(簿!Q13=\"\",0,簿!Q13)","v":0},""]
[{"$f":"IF(簿!M14=\"\",\"\",簿!M14)","v":""},{"$f":"IF(簿!N14=\"\",\"\",簿!N14)","v":""},{"$f":"IF(簿!O14=\"\",\"\",簿!O14)","v":""},null,{"$f":"IF(簿!P14=\"\",0,簿!P14)","v":0},{"$f":"IF(簿!Q14=\"\",0,簿!Q14)","v":0},""]
{"$rows_left_out":211}
{"sheet":"報告","index":5,"n_rows":123,"n_cols":22,"rows_kept":123,"cut":false,"hidden":false,"merged":[[93,6,93,8],[85,7,85,8],[85,13,85,14],[86,7,86,8],[86,13,86,14],[87,7,87,8],[88,7,88,8],[88,13,88,14],[89,7,89,8],[89,13,89,14],[24,13,24,14],[28,6,28,9],[24,7,24,8],[25,6,25,9],[25,13,25,14],[38,13,38,14],[28,13,28,14],[39,13,39,14],[90,7,90,8],[90,13,90,14],[50,7,50,8],[51,7,51,8],[38,7,38,8],[44,7,44,8],[45,7,45,8],[46,7,46,8],[47,7,47,8],[48,7,48,8],[36,7,36,8],[37,7,37,8],[42,7,42,8],[43,7,43,8],[80,11,80,12],[53,13,53,14],[119,13,119,14],[120,6,120,9],[98,13,98,14],[99,13,99,14],[98,6,98,9],[105,7,105,8],[107,13,107,14],[103,13,103,14],[106,13,106,14],[105,13,105,14],[118,7,118,8],[112,7,112,8],[113,7,113,8],[120,13,120,14],[102,13,102,14],[111,7,111,8],[112,13,112,14],[113,13,113,14],[118,13,118,14],[110,13,110,14],[111,13,111,14],[91,7,91,8],[29,13,29,14],[50,13,50,14],[51,13,51,14],[4,2,4,3],[5,2,5,3],[6,2,6,3],[7,2,7,3],[15,13,15,14],[15,7,15,8],[16,7,16,8],[18,7,18,8],[16,13,16,14],[3,7,4,11],[3,12,4,12],[8,6,8,14],[14,6,14,9],[14,13,14,14],[10,11,10,12],[11,11,11,12],[17,7,17,8],[21,7,21,8],[34,7,34,8],[42,13,42,14],[43,13,43,14],[94,7,94,8],[95,6,95,9],[84,6,84,9],[22,7,22,8],[23,13,23,14],[93,13,93,14],[101,13,101,14],[94,13,94,14],[95,13,95,14],[100,13,100,14],[52,7,52,8],[29,6,29,8],[41,6,41,9],[49,7,49,8],[92,7,92,8],[31,13,31,14],[81,11,81,12],[82,11,82,12],[84,13,84,14],[30,7,30,8],[31,7,31,8],[32,7,32,8],[33,7,33,8],[52,13,52,14],[55,13,55,14],[12,11,12,12],[18,13,18,14],[19,7,19,8],[20,7,20,8],[19,13,19,14],[20,13,20,14],[23,6,23,8],[78,6,78,14],[37,13,37,14],[56,12,56,13],[35,7,35,8],[40,13,40,14],[34,13,34,14],[30,13,30,14],[32,13,32,14],[33,13,33,14],[39,7,39,8],[40,7,40,8],[53,6,53,9],[44,13,44,14],[45,13,45,14],[46,13,46,14],[60,14,61,14],[114,7,114,8],[115,7,115,8],[116,7,116,8],[117,7,117,8],[119,7,119,8],[99,6,99,8],[109,6,109,9],[114,13,114,14],[115,13,115,14],[116,13,116,14],[117,13,117,14],[100,7,100,8],[101,7,101,8],[102,7,102,8],[103,7,103,8],[104,7,104,8],[106,7,106,8],[107,7,107,8],[108,7,108,8],[110,7,110,8],[104,13,104,14],[108,13,108,14]]}
[null," 中間・決算報告書作成"]
[]
[null,"中間報告月日",10.01,"小数の形で"]
[null,"決算報告月日",3.26,"　〃",null,null,null,"　 作成する報告書を選択→",null,null,null,null,"決算"]
[null,"代表者","〇〇　〇〇"]
[null,"監査委員１","△△　△△"]
[null,"監査委員２","◇◇　◇◇"]
[]
[null,null,null,null,null,null,{"$f":"\"令和\"&FIXED(予算!E4,0)&\"年度　\"&予算!C2&\"会計\"&M4&\"報告書\"","v":"令和8年度　〇〇中はまクル認定クラブ会計決算報告書"}]
[]
[null,"作成手順",null,null,null,null,null,null,null,null,"収 入 額",{"$f":"L26","v":677600},null,"円"]
[null,"①上の枠に必要事項を入力する。",null,null,null,null,null,null,null,null,"支 出 額",{"$f":"L54","v":677600},null,"円"]
[null,"②「中間」「決算」のいずれか",null,null,null,null,null,null,null,null,"差引残額",{"$f":"L11-L12","v":0},null,{"$f":"IF(M4=\"中間\",\"円\",IF(L13=0,\"円\",\"円（次年度へ繰越）\"))","v":"円"}]
[null,"　を選択する。",null,null,null,null,"収入の部"]
[null,"③報告書の備考欄を入力する。",null,null,null,null,"項　　　　　　目",null,null,null,"予 算 額",{"$f":"IF(M4=\"中間\",\"収入済額\",\"決 算 額\")","v":"決 算 額"},{"$f":"IF(M4=\"中間\",\"収入未済額\",\"増　　減\")","v":"増　　減"},"備　　　　　　　　　　考"]
{"$rows_left_out":109}
{"sheet":"第１１号様式","index":6,"n_rows":56,"n_cols":18,"rows_kept":56,"cut":false,"hidden":false,"merged":[[1,1,1,3],[3,1,3,9],[6,2,6,3],[6,4,6,9],[7,1,10,1],[7,2,10,3],[11,2,11,3],[11,4,11,9],[12,2,12,3],[12,4,12,9],[13,2,13,3],[13,4,13,9],[14,2,14,3],[14,4,14,9],[15,2,15,3],[15,4,15,9],[16,2,16,3],[16,4,16,9],[17,2,17,3],[17,4,17,9],[18,2,18,3],[18,4,18,9],[19,2,19,3],[19,4,19,9],[20,1,23,1],[20,2,23,3],[24,2,24,3],[24,4,24,9],[25,2,25,3],[25,4,25,9],[26,2,26,3],[26,4,26,9],[27,2,27,3],[27,4,27,9],[28,2,28,3],[28,4,28,9],[29,2,29,3],[29,4,29,9],[30,2,30,3],[30,4,30,9],[31,2,31,3],[31,4,31,9],[41,2,41,3],[41,4,41,9],[32,2,32,3],[32,4,32,9],[34,2,34,3],[34,4,34,9],[35,2,35,3],[35,4,35,9],[33,2,33,3],[33,4,33,9],[38,2,38,3],[38,4,38,9],[39,2,39,3],[40,2,40,3],[40,7,40,9],[42,2,42,3],[43,2,43,3],[43,7,43,9],[43,13,43,14],[44,2,44,3],[44,4,44,9],[44,13,44,14],[49,13,49,14],[45,2,45,3],[45,4,45,9],[45,13,45,14],[46,2,46,3],[46,4,46,9],[46,13,46,14],[47,2,47,3],[47,4,47,9],[47,13,47,14],[48,1,48,9],[48,13,48,14],[54,13,54,14],[55,13,57,16],[50,1,50,8],[50,13,50,14],[51,1,51,9],[51,13,51,14],[53,1,53,9],[53,13,53,14],[54,1,55,1],[54,2,55,2],[54,3,55,4],[54,5,55,5],[54,6,55,9]]}
[]
[null,"第１１号様式（第１２条関係）"]
[]
[null,"収支決算書"]
[]
[null,"【支出】",null,null,null,null,null,null,null,"(単位：円）"]
[null,"区分(勘定科目)","決算額",null,"積算根拠・内訳"]
[null,"謝金",{"$f":"報告!L31","v":287310},null,"指導者等報酬",null,"円",null,null,null,null,null,null,null,null,null,null,{"$f":"IF(J8=\"\",F8*H8*I8,F8*H8*I8*J8)","v":0}]
[null,null,null,null,null,null,null,null,null,null,null,null,null,null,null,null,null,{"$f":"IF(J9=\"\",F9*H9*I9,F9*H9*I9*J9)","v":0}]
[null,null,null,null,null,null,null,null,null,null,null,null,null,null,null,null,null,{"$f":"F10*H10*I10*J10","v":0}]
[null,null,null,null,null,null,null,null,null,null,null,null,null,null,null,null,null,{"$f":"F11*H11*I11","v":0}]
[null,"旅費",{"$f":"報告!L32","v":42000},null,"指導者大会交通費"]
[null,"通信運搬費",{"$f":"報告!L33","v":13000},null,"切手代等"]
[null,"印刷製本費",{"$f":"報告!L34","v":30000},null,"チラシ印刷代"]
[null,"会議費"]
{"$rows_left_out":42}
{"sheet":"単価データ","index":7,"n_rows":98,"n_cols":4,"rows_kept":98,"cut":false,"hidden":true,"merged":[]}
[null,null,{"$f":"予算!M4","v":6}]
[]
[null,1111,{"$f":"ROUNDDOWN((D3/12*$C$1),-3)","v":336000},673000]
[null,1112,{"$f":"ROUNDDOWN((D4/12*$C$1),-3)","v":275000},550000]
[null,1113,213000,427000]
[null,1114,152000,305000]
[null,1121,345000,691000]
[null,1122,284000,569000]
[null,1123,223000,446000]
[null,1124,161000,323000]
[null,2111,288000,576000]
[null,2112,237000,475000]
[null,2113,186000,373000]
[null,2114,136000,272000]
[null,2121,298000,596000]
{"$rows_left_out":84}
{"sheet":"補助金単価","index":8,"n_rows":21,"n_cols":12,"rows_kept":21,"cut":false,"hidden":false,"merged":[[4,2,4,3],[4,5,4,6],[4,7,4,8],[4,10,4,11],[5,0,6,0],[5,1,6,1],[7,0,8,0],[7,1,8,1],[9,0,10,0],[9,1,10,1],[14,2,14,3],[19,0,20,0],[19,1,20,1],[14,7,14,8],[14,10,14,11],[15,0,16,0],[15,1,16,1],[17,0,18,0],[17,1,18,1],[14,5,14,6]]}
["休日の地域クラブ活動の活動費等の支援（補助単価）",null,null,null,null,null,null,null,null,null,null,"別　紙"]
["【補助単価（1クラブ活動当たり年額）】"]
["＜令和8年度＞※9月以降の6か月分とした補助単価"]
[null,null,"※参加生徒数は、各月の参加生徒数の年間平均で算出する（小数点以下は切り上げ）。",null,null,null,null,null,null,null,null,"単位：円"]
["No.","区分","月4回程度活動",null,"クラブ数","月3回程度活動",null,"月2回程度活動",null,"クラブ数","月1回程度活動"]
[1,"参加生徒数27人以上で\n指導者を3人以上配置","スポーツ",{"$f":"単価データ!C3","v":336000},null,"スポーツ",{"$f":"単価データ!C4","v":275000},"スポーツ",{"$f":"単価データ!C5","v":213000},null,"スポーツ",{"$f":"単価データ!C6","v":152000}]
[null,null,"文化",{"$f":"単価データ!C7","v":345000},null,"文化",{"$f":"単価データ!C8","v":284000},"文化",{"$f":"単価データ!C9","v":223000},null,"文化",{"$f":"単価データ!C10","v":161000}]
[2,"参加生徒数13人～26人で\n指導者を2人配置","スポーツ",{"$f":"単価データ!C11","v":288000},96,"スポーツ",{"$f":"単価データ!C12","v":237000},"スポーツ",{"$f":"単価データ!C13","v":186000},32,"スポーツ",{"$f":"単価データ!C14","v":136000}]
[null,null,"文化",{"$f":"単価データ!C15","v":298000},24,"文化",{"$f":"単価データ!C16","v":247000},"文化",{"$f":"単価データ!C17","v":196000},8,"文化",{"$f":"単価データ!C18","v":145000}]
[3,"参加生徒数5人～12人で\n指導者を1人配置","スポーツ",{"$f":"単価データ!C19","v":211000},24,"スポーツ",{"$f":"単価データ!C20","v":178000},"スポーツ",{"$f":"単価データ!C21","v":145000},8,"スポーツ",{"$f":"単価データ!C22","v":112000}]
[null,null,"文化",{"$f":"単価データ!C23","v":221000},6,"文化",{"$f":"単価データ!C24","v":188000},"文化",{"$f":"単価データ!C25","v":155000},2,"文化",{"$f":"単価データ!C26","v":122000}]
[null,null,null,null,{"$f":"SUM(E8:E11)","v":150},null,null,null,null,{"$f":"SUM(J8:J11)","v":50}]
["＜令和9年度以降＞※12か月分"]
[null,null,"※参加生徒数は、各月の参加生徒数の年間平均で算出する（小数点以下は切り上げ）。",null,null,null,null,null,null,null,null,"単位：円"]
[null,null,"月4回程度活動",null,"クラブ数","月3回程度活動",null,"月2回程度活動",null,"クラブ数","月1回程度活動"]
{"$rows_left_out":6}